{"text_format":"1","workbook":"xlsx","n_sheets":4,"sheets":["nusinersen OS","est_summary","flex_fit","longterm"],"not_rendered":{"charts":4,"images":2,"macros":1,"external_links":0,"defined_names":0,"comments":0,"pivot_tables":0},"unopened":[],"bounds":{"document_bytes":16777216,"sheet_cells":100000,"rows_first":2000,"rows_last":500,"rows_between":2000,"halvings":0,"cell_chars":16384,"cell_head_chars":4096},"cells_cut":0,"cells_raw":0,"read":"whole","date_system":"1900"}

{"sheet":"nusinersen OS","index":0,"n_rows":232,"n_cols":7,"rows_kept":232,"cut":false,"hidden":false,"merged":[]}
["arm1_time","arm1_status","arm0_time","arm0_status","trisk","nrisk_arm1","nrisk_arm0"]
[0,1,0,1,0,80,41]
[6.6984105076716802E-2,0.99608040941616505,3.6930968647208497E-2,0.99634595056106601,13,71,33]
[0.30740919651277898,0.99710191697837003,1.148897016539,0.99633578630671604,26,58,23]
[0.54783428794884104,0.99710191697837003,1.50953465369309,0.99633578630671604,39,41,17]
[0.79427000667081005,0.99671084729224202,1.8701722908471901,0.99633578630671604,52,28,12]
[0.96857819796195299,0.98546257521548197,2.2308099280012801,0.99633578630671604,56,23,10]
[1.2090032893980101,0.98509920312245902,2.5914475651553799,0.99616553504634897]
[1.44942838083408,0.98509920312245902,2.8619257930209501,0.99600714208272301]
[1.6898534722701399,0.98509920312245902,2.8919789294504601,0.97292623800617895]
[1.9302785637062101,0.98509920312245902,2.9520852023094699,0.95854000650512206]
[2.1707036551422698,0.98509920312245902,2.9694293009454098,0.94696292080013]
[2.41112874657833,0.98535458001301002,3.4329353851816,0.94628191575865905]
[2.6515538380143999,0.98484382623190703,3.7935730223356998,0.94628191575865905]
[2.8919789294504601,0.98433307245080504,4.1542106594897898,0.94628191575865905]
{"$rows_left_out":218}
{"sheet":"est_summary","index":1,"n_rows":3,"n_cols":8,"rows_kept":3,"cut":false,"hidden":false,"merged":[]}
["HR for death"]
["HR","HR est","LB","LB est","HB","HB est","p","p est"]
[0.37,0.3765,0.18,0.1855,0.77,0.76400000000000001,4.0000000000000001E-3,6.8199999999999997E-3]

{"sheet":"flex_fit","index":2,"n_rows":263,"n_cols":26,"rows_kept":263,"cut":false,"hidden":false,"merged":[]}
["arm_0  \"sham control\"",null,null,null,null,null,null,null,null,"arm_0  \"sham control\""]
["Распределение","AIC","AIC, №","BIC","BIC, №","Coeff. 1","Coeff. 2","Coeff. 3",null,"week","Weibull","Gompertz","Log-logistic","Lognormal","Generalised Gamma","Exponential","est KM data",null,"week","Weibull","Gompertz","Log-logistic","Lognormal","Generalised Gamma","Exponential","est KM data"]
["Weibull",185.905,{"$f":"_xlfn.RANK.AVG(B3,B$3:B$8,1)","v":6},189.3321,{"$f":"_xlfn.RANK.AVG(D3,D$3:D$8,1)","v":6},0.85499999999999998,88.674000000000007,null,null,0,{"$f":"Fnc_Survival(K$2,$J3,VLOOKUP(K$2,$A$3:$H$8,6,FALSE),VLOOKUP(K$2,$A$3:$H$8,7,FALSE),VLOOKUP(K$2,$A$3:$H$8,8,FALSE))","v":1},{"$f":"Fnc_Survival(L$2,$J3,VLOOKUP(L$2,$A$3:$H$8,6,FALSE),VLOOKUP(L$2,$A$3:$H$8,7,FALSE),VLOOKUP(L$2,$A$3:$H$8,8,FALSE))","v":1},{"$f":"Fnc_Survival(M$2,$J3,VLOOKUP(M$2,$A$3:$H$8,6,FALSE),VLOOKUP(M$2,$A$3:$H$8,7,FALSE),VLOOKUP(M$2,$A$3:$H$8,8,FALSE))","v":1},{"$f":"Fnc_Survival(N$2,$J3,VLOOKUP(N$2,$A$3:$H$8,6,FALSE),VLOOKUP(N$2,$A$3:$H$8,7,FALSE),VLOOKUP(N$2,$A$3:$H$8,8,FALSE))","v":1},{"$f":"Fnc_Survival(O$2,$J3,VLOOKUP(O$2,$A$3:$H$8,6,FALSE),VLOOKUP(O$2,$A$3:$H$8,7,FALSE),VLOOKUP(O$2,$A$3:$H$8,8,FALSE))","v":1},{"$f":"Fnc_Survival(P$2,$J3,VLOOKUP(P$2,$A$3:$H$8,6,FALSE),VLOOKUP(P$2,$A$3:$H$8,7,FALSE),VLOOKUP(P$2,$A$3:$H$8,8,FALSE))","v":1},1,null,0,{"$f":"Fnc_Survival(T$2,$J3,VLOOKUP(T$2,$A$12:$H$18,6,FALSE),VLOOKUP(T$2,$A$12:$H$18,7,FALSE),VLOOKUP(T$2,$A$12:$H$18,8,FALSE))","v":1},{"$f":"Fnc_Survival(U$2,$J3,VLOOKUP(U$2,$A$12:$H$18,6,FALSE),VLOOKUP(U$2,$A$12:$H$18,7,FALSE),VLOOKUP(U$2,$A$12:$H$18,8,FALSE))","v":1},1,1,1,1,1]
["Gompertz",183.43709999999999,{"$f":"_xlfn.RANK.AVG(B4,B$3:B$8,1)","v":3},186.86429999999999,{"$f":"_xlfn.RANK.AVG(D4,D$3:D$8,1)","v":3},-3.0106910000000001E-2,{"$f":"EXP(-3.80363654)","v":2.2289567390613524E-2},null,null,1,{"$f":"Fnc_Survival(K$2,$J4,VLOOKUP(K$2,$A$3:$H$8,6,FALSE),VLOOKUP(K$2,$A$3:$H$8,7,FALSE),VLOOKUP(K$2,$A$3:$H$8,8,FALSE))","v":0.97862282638841125},{"$f":"Fnc_Survival(L$2,$J4,VLOOKUP(L$2,$A$3:$H$8,6,FALSE),VLOOKUP(L$2,$A$3:$H$8,7,FALSE),VLOOKUP(L$2,$A$3:$H$8,8,FALSE))","v":0.9782819339138572},{"$f":"Fnc_Survival(M$2,$J4,VLOOKUP(M$2,$A$3:$H$8,6,FALSE),VLOOKUP(M$2,$A$3:$H$8,7,FALSE),VLOOKUP(M$2,$A$3:$H$8,8,FALSE))","v":0.98352379223845965},{"$f":"Fnc_Survival(N$2,$J4,VLOOKUP(N$2,$A$3:$H$8,6,FALSE),VLOOKUP(N$2,$A$3:$H$8,7,FALSE),VLOOKUP(N$2,$A$3:$H$8,8,FALSE))","v":0.99279754737243076},{"$f":"Fnc_Survival(O$2,$J4,VLOOKUP(O$2,$A$3:$H$8,6,FALSE),VLOOKUP(O$2,$A$3:$H$8,7,FALSE),VLOOKUP(O$2,$A$3:$H$8,8,FALSE))","v":0.99999986199487312},{"$f":"Fnc_Survival(P$2,$J4,VLOOKUP(P$2,$A$3:$H$8,6,FALSE),VLOOKUP(P$2,$A$3:$H$8,7,FALSE),VLOOKUP(P$2,$A$3:$H$8,8,FALSE))","v":0.98737964902083231},1,null,1,{"$f":"Fnc_Survival(T$2,$J4,VLOOKUP(T$2,$A$12:$H$18,6,FALSE),VLOOKUP(T$2,$A$12:$H$18,7,FALSE),VLOOKUP(T$2,$A$12:$H$18,8,FALSE))","v":0.98890904976281913},0.99012606571229833,0.98978345273868995,0.99378661533838997,0.99681525009775207,0.99535084095384763,0.98750000000000004]
["Log-logistic",184.53829999999999,{"$f":"_xlfn.RANK.AVG(B5,B$3:B$8,1)","v":5},187.96539999999999,{"$f":"_xlfn.RANK.AVG(D5,D$3:D$8,1)","v":5},{"$f":"EXP(0.0133722)","v":1.0134620077289094},{"$f":"EXP(4.0349065)","v":56.537633722429163},null,null,2,{"$f":"Fnc_Survival(K$2,$J5,VLOOKUP(K$2,$A$3:$H$8,6,FALSE),VLOOKUP(K$2,$A$3:$H$8,7,FALSE),VLOOKUP(K$2,$A$3:$H$8,8,FALSE))","v":0.9616685575648497},{"$f":"Fnc_Survival(L$2,$J5,VLOOKUP(L$2,$A$3:$H$8,6,FALSE),VLOOKUP(L$2,$A$3:$H$8,7,FALSE),VLOOKUP(L$2,$A$3:$H$8,8,FALSE))","v":0.9576589824870605},{"$f":"Fnc_Survival(M$2,$J5,VLOOKUP(M$2,$A$3:$H$8,6,FALSE),VLOOKUP(M$2,$A$3:$H$8,7,FALSE),VLOOKUP(M$2,$A$3:$H$8,8,FALSE))","v":0.96728774094158665},{"$f":"Fnc_Survival(N$2,$J5,VLOOKUP(N$2,$A$3:$H$8,6,FALSE),VLOOKUP(N$2,$A$3:$H$8,7,FALSE),VLOOKUP(N$2,$A$3:$H$8,8,FALSE))","v":0.97883348651966262},{"$f":"Fnc_Survival(O$2,$J5,VLOOKUP(O$2,$A$3:$H$8,6,FALSE),VLOOKUP(O$2,$A$3:$H$8,7,FALSE),VLOOKUP(O$2,$A$3:$H$8,8,FALSE))","v":0.99809740602080288},{"$f":"Fnc_Survival(P$2,$J5,VLOOKUP(P$2,$A$3:$H$8,6,FALSE),VLOOKUP(P$2,$A$3:$H$8,7,FALSE),VLOOKUP(P$2,$A$3:$H$8,8,FALSE))","v":0.97491857130050186},0.95120000000000005,null,2,0.98121265603272667,0.98075381614313695,0.98211577145547924,0.98629776037083616,0.98903492860842723,0.99072329658753178,0.98750000000000004]
["Lognormal",183.0342,{"$f":"_xlfn.RANK.AVG(B6,B$3:B$8,1)","v":2},186.46129999999999,{"$f":"_xlfn.RANK.AVG(D6,D$3:D$8,1)","v":2},4.0696826000000001,{"$f":"EXP(0.5087004)","v":1.6631283882051626},null,null,3,{"$f":"Fnc_Survival(K$2,$J6,VLOOKUP(K$2,$A$3:$H$8,6,FALSE),VLOOKUP(K$2,$A$3:$H$8,7,FALSE),VLOOKUP(K$2,$A$3:$H$8,8,FALSE))","v":0.94621959080817819},{"$f":"Fnc_Survival(L$2,$J6,VLOOKUP(L$2,$A$3:$H$8,6,FALSE),VLOOKUP(L$2,$A$3:$H$8,7,FALSE),VLOOKUP(L$2,$A$3:$H$8,8,FALSE))","v":0.93806335644065242},{"$f":"Fnc_Survival(M$2,$J6,VLOOKUP(M$2,$A$3:$H$8,6,FALSE),VLOOKUP(M$2,$A$3:$H$8,7,FALSE),VLOOKUP(M$2,$A$3:$H$8,8,FALSE))","v":0.95146984453100336},{"$f":"Fnc_Survival(N$2,$J6,VLOOKUP(N$2,$A$3:$H$8,6,FALSE),VLOOKUP(N$2,$A$3:$H$8,7,FALSE),VLOOKUP(N$2,$A$3:$H$8,8,FALSE))","v":0.96298555164097588},{"$f":"Fnc_Survival(O$2,$J6,VLOOKUP(O$2,$A$3:$H$8,6,FALSE),VLOOKUP(O$2,$A$3:$H$8,7,FALSE),VLOOKUP(O$2,$A$3:$H$8,8,FALSE))","v":0.98326625802747869},{"$f":"Fnc_Survival(P$2,$J6,VLOOKUP(P$2,$A$3:$H$8,6,FALSE),VLOOKUP(P$2,$A$3:$H$8,7,FALSE),VLOOKUP(P$2,$A$3:$H$8,8,FALSE))","v":0.96261475675458086},0.95120000000000005,null,3,0.97445788460855187,0.97185416937760261,0.97524627470392034,0.97900814959721782,0.98040244647390362,0.98611726641096797,0.98750000000000004]
["Generalised Gamma",181.9391,{"$f":"_xlfn.RANK.AVG(B7,B$3:B$8,1)","v":1},187.07980000000001,{"$f":"_xlfn.RANK.AVG(D7,D$3:D$8,1)","v":4},2.3592445999999998,{"$f":"EXP(0.3895037)","v":1.4762479501848447},-2.8359999999999999,null,4,{"$f":"Fnc_Survival(K$2,$J7,VLOOKUP(K$2,$A$3:$H$8,6,FALSE),VLOOKUP(K$2,$A$3:$H$8,7,FALSE),VLOOKUP(K$2,$A$3:$H$8,8,FALSE))","v":0.93174500638340951},{"$f":"Fnc_Survival(L$2,$J7,VLOOKUP(L$2,$A$3:$H$8,6,FALSE),VLOOKUP(L$2,$A$3:$H$8,7,FALSE),VLOOKUP(L$2,$A$3:$H$8,8,FALSE))","v":0.91943228387496534},{"$f":"Fnc_Survival(M$2,$J7,VLOOKUP(M$2,$A$3:$H$8,6,FALSE),VLOOKUP(M$2,$A$3:$H$8,7,FALSE),VLOOKUP(M$2,$A$3:$H$8,8,FALSE))","v":0.93609191402626712},{"$f":"Fnc_Survival(N$2,$J7,VLOOKUP(N$2,$A$3:$H$8,6,FALSE),VLOOKUP(N$2,$A$3:$H$8,7,FALSE),VLOOKUP(N$2,$A$3:$H$8,8,FALSE))","v":0.94667750795694883},{"$f":"Fnc_Survival(O$2,$J7,VLOOKUP(O$2,$A$3:$H$8,6,FALSE),VLOOKUP(O$2,$A$3:$H$8,7,FALSE),VLOOKUP(O$2,$A$3:$H$8,8,FALSE))","v":0.95792406393676077},{"$f":"Fnc_Survival(P$2,$J7,VLOOKUP(P$2,$A$3:$H$8,6,FALSE),VLOOKUP(P$2,$A$3:$H$8,7,FALSE),VLOOKUP(P$2,$A$3:$H$8,8,FALSE))","v":0.95046622066661179},0.95120000000000005,null,4,0.96826185653122254,0.96340002376273515,0.96887434158272978,0.97203799495479359,0.97191533934610796,0.98153265040126647,0.98750000000000004]
["Exponential",184.44739999999999,{"$f":"_xlfn.RANK.AVG(B8,B$3:B$8,1)","v":4},186.161,{"$f":"_xlfn.RANK.AVG(D8,D$3:D$8,1)","v":1},{"$f":"EXP(-4.366101)","v":1.2700664043433193E-2},null,null,null,5,{"$f":"Fnc_Survival(K$2,$J8,VLOOKUP(K$2,$A$3:$H$8,6,FALSE),VLOOKUP(K$2,$A$3:$H$8,7,FALSE),VLOOKUP(K$2,$A$3:$H$8,8,FALSE))","v":0.91800118269119857},{"$f":"Fnc_Survival(L$2,$J8,VLOOKUP(L$2,$A$3:$H$8,6,FALSE),VLOOKUP(L$2,$A$3:$H$8,7,FALSE),VLOOKUP(L$2,$A$3:$H$8,8,FALSE))","v":0.90170758188989275},{"$f":"Fnc_Survival(M$2,$J8,VLOOKUP(M$2,$A$3:$H$8,6,FALSE),VLOOKUP(M$2,$A$3:$H$8,7,FALSE),VLOOKUP(M$2,$A$3:$H$8,8,FALSE))","v":0.92115324577730928},{"$f":"Fnc_Survival(N$2,$J8,VLOOKUP(N$2,$A$3:$H$8,6,FALSE),VLOOKUP(N$2,$A$3:$H$8,7,FALSE),VLOOKUP(N$2,$A$3:$H$8,8,FALSE))","v":0.93046822592585965},{"$f":"Fnc_Survival(O$2,$J8,VLOOKUP(O$2,$A$3:$H$8,6,FALSE),VLOOKUP(O$2,$A$3:$H$8,7,FALSE),VLOOKUP(O$2,$A$3:$H$8,8,FALSE))","v":0.93001743656851887},{"$f":"Fnc_Survival(P$2,$J8,VLOOKUP(P$2,$A$3:$H$8,6,FALSE),VLOOKUP(P$2,$A$3:$H$8,7,FALSE),VLOOKUP(P$2,$A$3:$H$8,8,FALSE))","v":0.93847100336795608},0.878,null,5,0.96245805624107561,0.95536609960721175,0.96286480527390583,0.96538797046638114,0.96383303487817773,0.97696934900055954,0.98750000000000004]
[null,null,null,null,null,null,null,null,null,6,{"$f":"Fnc_Survival(K$2,$J9,VLOOKUP(K$2,$A$3:$H$8,6,FALSE),VLOOKUP(K$2,$A$3:$H$8,7,FALSE),VLOOKUP(K$2,$A$3:$H$8,8,FALSE))","v":0.90484710922584632},{"$f":"Fnc_Survival(L$2,$J9,VLOOKUP(L$2,$A$3:$H$8,6,FALSE),VLOOKUP(L$2,$A$3:$H$8,7,FALSE),VLOOKUP(L$2,$A$3:$H$8,8,FALSE))","v":0.88483526924187816},{"$f":"Fnc_Survival(M$2,$J9,VLOOKUP(M$2,$A$3:$H$8,6,FALSE),VLOOKUP(M$2,$A$3:$H$8,7,FALSE),VLOOKUP(M$2,$A$3:$H$8,8,FALSE))","v":0.90664523280814824},{"$f":"Fnc_Survival(N$2,$J9,VLOOKUP(N$2,$A$3:$H$8,6,FALSE),VLOOKUP(N$2,$A$3:$H$8,7,FALSE),VLOOKUP(N$2,$A$3:$H$8,8,FALSE))","v":0.91460372346862351},{"$f":"Fnc_Survival(O$2,$J9,VLOOKUP(O$2,$A$3:$H$8,6,FALSE),VLOOKUP(O$2,$A$3:$H$8,7,FALSE),VLOOKUP(O$2,$A$3:$H$8,8,FALSE))","v":0.90319209613700813},{"$f":"Fnc_Survival(P$2,$J9,VLOOKUP(P$2,$A$3:$H$8,6,FALSE),VLOOKUP(P$2,$A$3:$H$8,7,FALSE),VLOOKUP(P$2,$A$3:$H$8,8,FALSE))","v":0.92662716992168082},0.878,null,6,0.95695400483194015,0.94772879539907229,0.95714064864159276,0.9590354845242306,0.95620978541519097,0.97242726311383998,0.97499999999999998]
[null,null,null,null,null,null,null,null,null,7,{"$f":"Fnc_Survival(K$2,$J10,VLOOKUP(K$2,$A$3:$H$8,6,FALSE),VLOOKUP(K$2,$A$3:$H$8,7,FALSE),VLOOKUP(K$2,$A$3:$H$8,8,FALSE))","v":0.89219045066724501},{"$f":"Fnc_Survival(L$2,$J10,VLOOKUP(L$2,$A$3:$H$8,6,FALSE),VLOOKUP(L$2,$A$3:$H$8,7,FALSE),VLOOKUP(L$2,$A$3:$H$8,8,FALSE))","v":0.86876521570832499},{"$f":"Fnc_Survival(M$2,$J10,VLOOKUP(M$2,$A$3:$H$8,6,FALSE),VLOOKUP(M$2,$A$3:$H$8,7,FALSE),VLOOKUP(M$2,$A$3:$H$8,8,FALSE))","v":0.89255590033967247},{"$f":"Fnc_Survival(N$2,$J10,VLOOKUP(N$2,$A$3:$H$8,6,FALSE),VLOOKUP(N$2,$A$3:$H$8,7,FALSE),VLOOKUP(N$2,$A$3:$H$8,8,FALSE))","v":0.89919436529369223},{"$f":"Fnc_Survival(O$2,$J10,VLOOKUP(O$2,$A$3:$H$8,6,FALSE),VLOOKUP(O$2,$A$3:$H$8,7,FALSE),VLOOKUP(O$2,$A$3:$H$8,8,FALSE))","v":0.87856786693485955},{"$f":"Fnc_Survival(P$2,$J10,VLOOKUP(P$2,$A$3:$H$8,6,FALSE),VLOOKUP(P$2,$A$3:$H$8,7,FALSE),VLOOKUP(P$2,$A$3:$H$8,8,FALSE))","v":0.91493280981043623},0.878,null,7,{"$f":"Fnc_Survival(T$2,$J10,VLOOKUP(T$2,$A$12:$H$18,6,FALSE),VLOOKUP(T$2,$A$12:$H$18,7,FALSE),VLOOKUP(T$2,$A$12:$H$18,8,FALSE))","v":0.95169124664562454},0.94046605705291442,0.95165211596633681,0.95295436904107089,0.94903481495564779,0.96790629410680917,0.96250000000000002]
["arm_1 \"nusinersen\"",null,null,null,null,null,null,null,null,8,{"$f":"Fnc_Survival(K$2,$J11,VLOOKUP(K$2,$A$3:$H$8,6,FALSE),VLOOKUP(K$2,$A$3:$H$8,7,FALSE),VLOOKUP(K$2,$A$3:$H$8,8,FALSE))","v":0.87996584049142346},{"$f":"Fnc_Survival(L$2,$J11,VLOOKUP(L$2,$A$3:$H$8,6,FALSE),VLOOKUP(L$2,$A$3:$H$8,7,FALSE),VLOOKUP(L$2,$A$3:$H$8,8,FALSE))","v":0.85345082432656472},{"$f":"Fnc_Survival(M$2,$J11,VLOOKUP(M$2,$A$3:$H$8,6,FALSE),VLOOKUP(M$2,$A$3:$H$8,7,FALSE),VLOOKUP(M$2,$A$3:$H$8,8,FALSE))","v":0.87887178850900838},{"$f":"Fnc_Survival(N$2,$J11,VLOOKUP(N$2,$A$3:$H$8,6,FALSE),VLOOKUP(N$2,$A$3:$H$8,7,FALSE),VLOOKUP(N$2,$A$3:$H$8,8,FALSE))","v":0.88428535295599686},{"$f":"Fnc_Survival(O$2,$J11,VLOOKUP(O$2,$A$3:$H$8,6,FALSE),VLOOKUP(O$2,$A$3:$H$8,7,FALSE),VLOOKUP(O$2,$A$3:$H$8,8,FALSE))","v":0.8562989511672241},{"$f":"Fnc_Survival(P$2,$J11,VLOOKUP(P$2,$A$3:$H$8,6,FALSE),VLOOKUP(P$2,$A$3:$H$8,7,FALSE),VLOOKUP(P$2,$A$3:$H$8,8,FALSE))","v":0.90338603662827244},0.878,null,8,0.94662968642401024,0.93355725886546315,0.9463644104872545,0.94711987872764836,0.94227679326341529,0.96340634380373469,0.94979999999999998]
["Распределение","AIC","AIC, №","BIC","BIC, №","Coeff. 1","Coeff. 2","Coeff. 3",null,9,{"$f":"Fnc_Survival(K$2,$J12,VLOOKUP(K$2,$A$3:$H$8,6,FALSE),VLOOKUP(K$2,$A$3:$H$8,7,FALSE),VLOOKUP(K$2,$A$3:$H$8,8,FALSE))","v":0.86812443151670016},{"$f":"Fnc_Survival(L$2,$J12,VLOOKUP(L$2,$A$3:$H$8,6,FALSE),VLOOKUP(L$2,$A$3:$H$8,7,FALSE),VLOOKUP(L$2,$A$3:$H$8,8,FALSE))","v":0.8388487431097017},{"$f":"Fnc_Survival(M$2,$J12,VLOOKUP(M$2,$A$3:$H$8,6,FALSE),VLOOKUP(M$2,$A$3:$H$8,7,FALSE),VLOOKUP(M$2,$A$3:$H$8,8,FALSE))","v":0.86557886382433502},{"$f":"Fnc_Survival(N$2,$J12,VLOOKUP(N$2,$A$3:$H$8,6,FALSE),VLOOKUP(N$2,$A$3:$H$8,7,FALSE),VLOOKUP(N$2,$A$3:$H$8,8,FALSE))","v":0.86988866443287138},{"$f":"Fnc_Survival(O$2,$J12,VLOOKUP(O$2,$A$3:$H$8,6,FALSE),VLOOKUP(O$2,$A$3:$H$8,7,FALSE),VLOOKUP(O$2,$A$3:$H$8,8,FALSE))","v":0.83621728245296256},{"$f":"Fnc_Survival(P$2,$J12,VLOOKUP(P$2,$A$3:$H$8,6,FALSE),VLOOKUP(P$2,$A$3:$H$8,7,FALSE),VLOOKUP(P$2,$A$3:$H$8,8,FALSE))","v":0.89198498777634438},0.878,null,9,0.94174021872585401,0.92698309500547549,0.94125182168830135,0.94150988170315175,0.93589953247425339,0.95892731448531898,0.93720000000000003]
["Weibull",181.09110000000001,{"$f":"_xlfn.RANK.AVG(B13,B$13:B$18,1)","v":6},185.8552,{"$f":"_xlfn.RANK.AVG(D13,D$13:D$18,1)","v":5},0.76600000000000001,354.08,null,null,10,{"$f":"Fnc_Survival(K$2,$J13,VLOOKUP(K$2,$A$3:$H$8,6,FALSE),VLOOKUP(K$2,$A$3:$H$8,7,FALSE),VLOOKUP(K$2,$A$3:$H$8,8,FALSE))","v":0.85662823780646136},{"$f":"Fnc_Survival(L$2,$J13,VLOOKUP(L$2,$A$3:$H$8,6,FALSE),VLOOKUP(L$2,$A$3:$H$8,7,FALSE),VLOOKUP(L$2,$A$3:$H$8,8,FALSE))","v":0.82491860322363775},{"$f":"Fnc_Survival(M$2,$J13,VLOOKUP(M$2,$A$3:$H$8,6,FALSE),VLOOKUP(M$2,$A$3:$H$8,7,FALSE),VLOOKUP(M$2,$A$3:$H$8,8,FALSE))","v":0.85266300225213421},{"$f":"Fnc_Survival(N$2,$J13,VLOOKUP(N$2,$A$3:$H$8,6,FALSE),VLOOKUP(N$2,$A$3:$H$8,7,FALSE),VLOOKUP(N$2,$A$3:$H$8,8,FALSE))","v":0.85599883949878786},{"$f":"Fnc_Survival(O$2,$J13,VLOOKUP(O$2,$A$3:$H$8,6,FALSE),VLOOKUP(O$2,$A$3:$H$8,7,FALSE),VLOOKUP(O$2,$A$3:$H$8,8,FALSE))","v":0.81807027870102433},{"$f":"Fnc_Survival(P$2,$J13,VLOOKUP(P$2,$A$3:$H$8,6,FALSE),VLOOKUP(P$2,$A$3:$H$8,7,FALSE),VLOOKUP(P$2,$A$3:$H$8,8,FALSE))","v":0.88072782416245821},0.85370000000000001,null,10,0.93700081471844132,0.92072548049323699,0.9362945682622702,0.9361049313295905,0.92986773372130194,0.95446910888657699,0.93720000000000003]
["Gompertz",177.8347,{"$f":"_xlfn.RANK.AVG(B14,B$13:B$18,1)","v":1},182.59870000000001,{"$f":"_xlfn.RANK.AVG(D14,D$13:D$18,1)","v":1},-4.2428E-2,1.0135E-2,null,null,11,{"$f":"Fnc_Survival(K$2,$J14,VLOOKUP(K$2,$A$3:$H$8,6,FALSE),VLOOKUP(K$2,$A$3:$H$8,7,FALSE),VLOOKUP(K$2,$A$3:$H$8,8,FALSE))","v":0.84544680237408754},{"$f":"Fnc_Survival(L$2,$J14,VLOOKUP(L$2,$A$3:$H$8,6,FALSE),VLOOKUP(L$2,$A$3:$H$8,7,FALSE),VLOOKUP(L$2,$A$3:$H$8,8,FALSE))","v":0.81162278094532636},{"$f":"Fnc_Survival(M$2,$J14,VLOOKUP(M$2,$A$3:$H$8,6,FALSE),VLOOKUP(M$2,$A$3:$H$8,7,FALSE),VLOOKUP(M$2,$A$3:$H$8,8,FALSE))","v":0.84011025899854641},{"$f":"Fnc_Survival(N$2,$J14,VLOOKUP(N$2,$A$3:$H$8,6,FALSE),VLOOKUP(N$2,$A$3:$H$8,7,FALSE),VLOOKUP(N$2,$A$3:$H$8,8,FALSE))","v":0.84260126692089865},{"$f":"Fnc_Survival(O$2,$J14,VLOOKUP(O$2,$A$3:$H$8,6,FALSE),VLOOKUP(O$2,$A$3:$H$8,7,FALSE),VLOOKUP(O$2,$A$3:$H$8,8,FALSE))","v":0.80160482257463206},{"$f":"Fnc_Survival(P$2,$J14,VLOOKUP(P$2,$A$3:$H$8,6,FALSE),VLOOKUP(P$2,$A$3:$H$8,7,FALSE),VLOOKUP(P$2,$A$3:$H$8,8,FALSE))","v":0.8696127299044093},0.82930000000000004,null,11,0.93239425767710338,0.91476746073876292,0.93147695064810743,0.93088801297193902,0.92414897913281457,0.95003163019472403,0.93720000000000003]
["Log-logistic",180.6421,{"$f":"_xlfn.RANK.AVG(B15,B$13:B$18,1)","v":4},185.40620000000001,{"$f":"_xlfn.RANK.AVG(D15,D$13:D$18,1)","v":4},0.81899999999999995,266.19299999999998,null,null,12,{"$f":"Fnc_Survival(K$2,$J15,VLOOKUP(K$2,$A$3:$H$8,6,FALSE),VLOOKUP(K$2,$A$3:$H$8,7,FALSE),VLOOKUP(K$2,$A$3:$H$8,8,FALSE))","v":0.83455510621806672},{"$f":"Fnc_Survival(L$2,$J15,VLOOKUP(L$2,$A$3:$H$8,6,FALSE),VLOOKUP(L$2,$A$3:$H$8,7,FALSE),VLOOKUP(L$2,$A$3:$H$8,8,FALSE))","v":0.79892618101777968},{"$f":"Fnc_Survival(M$2,$J15,VLOOKUP(M$2,$A$3:$H$8,6,FALSE),VLOOKUP(M$2,$A$3:$H$8,7,FALSE),VLOOKUP(M$2,$A$3:$H$8,8,FALSE))","v":0.82790702269693672},{"$f":"Fnc_Survival(N$2,$J15,VLOOKUP(N$2,$A$3:$H$8,6,FALSE),VLOOKUP(N$2,$A$3:$H$8,7,FALSE),VLOOKUP(N$2,$A$3:$H$8,8,FALSE))","v":0.82967672165119233},{"$f":"Fnc_Survival(O$2,$J15,VLOOKUP(O$2,$A$3:$H$8,6,FALSE),VLOOKUP(O$2,$A$3:$H$8,7,FALSE),VLOOKUP(O$2,$A$3:$H$8,8,FALSE))","v":0.78659403896729452},{"$f":"Fnc_Survival(P$2,$J15,VLOOKUP(P$2,$A$3:$H$8,6,FALSE),VLOOKUP(P$2,$A$3:$H$8,7,FALSE),VLOOKUP(P$2,$A$3:$H$8,8,FALSE))","v":0.85863791203706341},0.78049999999999997,null,12,0.92790674464766221,0.90909312880820758,0.92678619846441956,0.92584422166058344,0.91871424092137044,0.94561478204707339,0.8992]
{"$rows_left_out":249}
{"sheet":"longterm","index":3,"n_rows":8,"n_cols":11,"rows_kept":8,"cut":false,"hidden":false,"merged":[]}
[]
["Overall survival"]
["arm, model / week",0,13,26,39,52,56,{"$f":"2*52","v":104},{"$f":"3*52","v":156},{"$f":"4*52","v":208},{"$f":"5*52","v":260}]
["placebo, est KM data",{"$f":"VLOOKUP(B$3,flex_fit!$J$2:$Q$263,8,FALSE)","v":1},{"$f":"VLOOKUP(C$3,flex_fit!$J$2:$Q$263,8,FALSE)","v":0.78049999999999997},{"$f":"VLOOKUP(D$3,flex_fit!$J$2:$Q$263,8,FALSE)","v":0.65310000000000001},{"$f":"VLOOKUP(E$3,flex_fit!$J$2:$Q$263,8,FALSE)","v":0.55649999999999999},{"$f":"VLOOKUP(F$3,flex_fit!$J$2:$Q$263,8,FALSE)","v":0.55649999999999999},{"$f":"VLOOKUP(G$3,flex_fit!$J$2:$Q$263,8,FALSE)","v":0.55649999999999999}]
["placebo, gengamma (AIC best)",{"$f":"VLOOKUP(B$3,flex_fit!$J$2:$Q$263,6,FALSE)","v":1},{"$f":"VLOOKUP(C$3,flex_fit!$J$2:$Q$263,6,FALSE)","v":0.77284297821462555},{"$f":"VLOOKUP(D$3,flex_fit!$J$2:$Q$263,6,FALSE)","v":0.65930147498083358},{"$f":"VLOOKUP(E$3,flex_fit!$J$2:$Q$263,6,FALSE)","v":0.59923139893150124},{"$f":"VLOOKUP(F$3,flex_fit!$J$2:$Q$263,6,FALSE)","v":0.55970417342321888},{"$f":"VLOOKUP(G$3,flex_fit!$J$2:$Q$263,6,FALSE)","v":0.5499309959522809},{"$f":"VLOOKUP(H$3,flex_fit!$J$2:$Q$263,6,FALSE)","v":0.47452824763900153},{"$f":"VLOOKUP(I$3,flex_fit!$J$2:$Q$263,6,FALSE)","v":0.4307664092954866},{"$f":"VLOOKUP(J$3,flex_fit!$J$2:$Q$263,6,FALSE)","v":0.40217401230205607},{"$f":"VLOOKUP(K$3,flex_fit!$J$2:$Q$263,6,FALSE)","v":0.38130576532097471}]
["placebo, exponential (best BIC)",{"$f":"VLOOKUP(B$3,flex_fit!$J$2:$Q$263,7,FALSE)","v":1},{"$f":"VLOOKUP(C$3,flex_fit!$J$2:$Q$263,7,FALSE)","v":0.84780160022313589},{"$f":"VLOOKUP(D$3,flex_fit!$J$2:$Q$263,7,FALSE)","v":0.71876755334091003},{"$f":"VLOOKUP(E$3,flex_fit!$J$2:$Q$263,7,FALSE)","v":0.60937228191089177},{"$f":"VLOOKUP(F$3,flex_fit!$J$2:$Q$263,7,FALSE)","v":0.51662679573567794},{"$f":"VLOOKUP(G$3,flex_fit!$J$2:$Q$263,7,FALSE)","v":0.49103631803799141},{"$f":"VLOOKUP(H$3,flex_fit!$J$2:$Q$263,7,FALSE)","v":0.26690324607211391},{"$f":"VLOOKUP(I$3,flex_fit!$J$2:$Q$263,7,FALSE)","v":0.13788936878968738},{"$f":"VLOOKUP(J$3,flex_fit!$J$2:$Q$263,7,FALSE)","v":7.1237342763831382E-2},{"$f":"VLOOKUP(K$3,flex_fit!$J$2:$Q$263,7,FALSE)","v":3.6803120128802394E-2}]
["nusinersen, est KM data",{"$f":"VLOOKUP(B$3,flex_fit!$S$2:$Z$263,8,FALSE)","v":1},{"$f":"VLOOKUP(C$3,flex_fit!$S$2:$Z$263,8,FALSE)","v":0.8992},{"$f":"VLOOKUP(D$3,flex_fit!$S$2:$Z$263,8,FALSE)","v":0.85909999999999997},{"$f":"VLOOKUP(E$3,flex_fit!$S$2:$Z$263,8,FALSE)","v":0.81240000000000001},{"$f":"VLOOKUP(F$3,flex_fit!$S$2:$Z$263,8,FALSE)","v":0.81240000000000001},{"$f":"VLOOKUP(G$3,flex_fit!$S$2:$Z$263,8,FALSE)","v":0.81240000000000001}]
["nusinersen, Gompertz (AIC and BIC best)",{"$f":"VLOOKUP(B$3,flex_fit!$S$2:$Z$263,3,FALSE)","v":1},{"$f":"VLOOKUP(C$3,flex_fit!$S$2:$Z$263,3,FALSE)","v":0.90368754967662313},{"$f":"VLOOKUP(D$3,flex_fit!$S$2:$Z$263,3,FALSE)","v":0.85247709859944498},{"$f":"VLOOKUP(E$3,flex_fit!$S$2:$Z$263,3,FALSE)","v":0.82430551846780786},{"$f":"VLOOKUP(F$3,flex_fit!$S$2:$Z$263,3,FALSE)","v":0.80850193686536898},{"$f":"VLOOKUP(G$3,flex_fit!$S$2:$Z$263,3,FALSE)","v":0.80518927322869505},{"$f":"VLOOKUP(H$3,flex_fit!$S$2:$Z$263,3,FALSE)","v":0.78979727202130445},{"$f":"VLOOKUP(I$3,flex_fit!$S$2:$Z$263,3,FALSE)","v":0.78776429278119731},{"$f":"VLOOKUP(J$3,flex_fit!$S$2:$Z$263,3,FALSE)","v":0.78754075716822458},{"$f":"VLOOKUP(K$3,flex_fit!$S$2:$Z$263,3,FALSE)","v":0.78751614706114592}]